• Welcome to TUKE FÓRUM - Fórum pre študentov Technickej Univerzity v Košiciach.
 
Menu

Zobrazi� pr�spevky

This section allows you to view all posts made by this member. Note that you can only see posts made in areas you currently have access to.

Zobrazi� pr�spevky Menu

Messages - kubiaxk

#1
Problem sloved .... preinštaloval som OEM W7 starter za pančovaný Ultimate x64  a nainštaloval znova a všetko už ide jak ma  .... takže W7 s = MEGAULTRABULŠIT
#2




tuto na netbooku to neviem rozbehat :D  este ze na PC mi to ide   :buttrock:


#lilu ne ne pri inštalácií som nezabudol na nič ...
#3
Na pc sa mi to nejak podarilo rozbehat, ale na nb som nainstalloval presne ako na pc ... a robi mi to zase takuto chybu pri programe Hello world

screen:



Error
"/usr/bin/make" -f nbproject/Makefile-Debug.mk QMAKE= SUBPROJECTS= .build-conf
make[1]: Entering directory `/cygdrive/c/Users/kubiaxk/Documents/NetBeansProjects/CppApplication_2'
"/usr/bin/make"  -f nbproject/Makefile-Debug.mk dist/Debug/Cygwin-Windows/cppapplication_2.exe
make[2]: Entering directory `/cygdrive/c/Users/kubiaxk/Documents/NetBeansProjects/CppApplication_2'
mkdir -p build/Debug/Cygwin-Windows
rm -f build/Debug/Cygwin-Windows/main.o.d
gcc.exe    -c -g -MMD -MP -MF build/Debug/Cygwin-Windows/main.o.d -o build/Debug/Cygwin-Windows/main.o main.c
nbproject/Makefile-Debug.mk:65: recipe for target `build/Debug/Cygwin-Windows/main.o' failed
make[2]: Leaving directory `/cygdrive/c/Users/kubiaxk/Documents/NetBeansProjects/CppApplication_2'
nbproject/Makefile-Debug.mk:58: recipe for target `.build-conf' failed
make[1]: Leaving directory `/cygdrive/c/Users/kubiaxk/Documents/NetBeansProjects/CppApplication_2'
nbproject/Makefile-impl.mk:39: recipe for target `.build-impl' failed
make[2]: gcc.exe: Command not found
make[2]: *** [build/Debug/Cygwin-Windows/main.o] Error 127
make[1]: *** [.build-conf] Error 2
make: *** [.build-impl] Error 2


BUILD FAILED (exit value 2, total time: 2s)




+ wtf je toto a ma to asi suvis s tym ze mi to zase nejde debugnut co ?












sorry fakt som v tom lama a nevyznam sa v tych vypisoch .... tak to davam sem



#4
Pozývam ťa na pivo  :buttrock:
#5
myslím že v tom to nebude ... presunul som to do source robí to to isté  ....


nejaké iné nápady prečo mi to hádže tie 

.
.
.
.
.
make[1]: *** [.build-conf] Error 2
make: *** [.build-impl] Error 2


BUILD FAILED (exit value 2, total time: 458ms)
#6
Mám problém s týmto tu programom ...

nainštaloval som si to všetko podľa tutorialu ...  http://it4kt.fei.tuke.sk/c/pvjc/installation.html



Nejde mi v tom debugnuť a spustiť ani ten najzákladnejší program aký existuje

#include <stdio.h>

int main(void) {
     printf("Hello, world!\n");
     return 0;
}




hádže mi to toto :









Moje nastavenia:









Keďže v NB musím robiť zadanie dosť ma to vytáča , že mi to  nejde , ... nenapadá vás nejaké riešenie ?   :ropebanana: