Mám problém s týmto tu programom ...
nainštaloval som si to všetko podľa tutorialu ... http://it4kt.fei.tuke.sk/c/pvjc/installation.html (http://it4kt.fei.tuke.sk/c/pvjc/installation.html)
Nejde mi v tom debugnuť a spustiť ani ten najzákladnejší program aký existuje
#include <stdio.h>
int main(void) {
printf("Hello, world!\n");
return 0;
}
hádže mi to toto :
(https://www.tu-ke.com/forum/proxy.php?request=http%3A%2F%2Fkubiaxk.hustej.net%2Fnb%2F1.jpg&hash=991eeed6f2c3383b41531d15957c7c583447e393)
Moje nastavenia:
(https://www.tu-ke.com/forum/proxy.php?request=http%3A%2F%2Fkubiaxk.hustej.net%2Fnb%2F2.jpg&hash=b1e4f03ee7e9d11597aaa66e9729a2b6f00fbc70)
(https://www.tu-ke.com/forum/proxy.php?request=http%3A%2F%2Fkubiaxk.hustej.net%2Fnb%2F3.jpg&hash=63a0c9b27cd1f45f36e87268af1802d7a68d6808)
Keďže v NB musím robiť zadanie dosť ma to vytáča , že mi to nejde , ... nenapadá vás nejaké riešenie ? :ropebanana:
nemas nahodou este subor main s funkciou man v tej zlozke source ? ked kliknes na plus
myslím že v tom to nebude ... presunul som to do source robí to to isté ....
nejaké iné nápady prečo mi to hádže tie
.
.
.
.
.
make[1]: *** [.build-conf] Error 2
make: *** [.build-impl] Error 2
BUILD FAILED (exit value 2, total time: 458ms)
mas tam dve main funkcie urcite, a mozes mat v projekte len jednu cize naco si robil newmain.c ked uz tam mas jednu main.c ?
Pozývam ťa na pivo :buttrock:
ved uz v prvom screenshote mas 'multiple definition of _main' a podtym kde je definovane prvykrat. tie vypisy tam niesu pre srandu, staci ich citat
Na pc sa mi to nejak podarilo rozbehat, ale na nb som nainstalloval presne ako na pc ... a robi mi to zase takuto chybu pri programe Hello world
screen:
(https://www.tu-ke.com/forum/proxy.php?request=http%3A%2F%2Fkubiaxk.hustej.net%2Fnb%2F4.png&hash=5bf1b839102ab1531d585b5a9ef0d964720922dc)
Error
"/usr/bin/make" -f nbproject/Makefile-Debug.mk QMAKE= SUBPROJECTS= .build-conf
make[1]: Entering directory `/cygdrive/c/Users/kubiaxk/Documents/NetBeansProjects/CppApplication_2'
"/usr/bin/make" -f nbproject/Makefile-Debug.mk dist/Debug/Cygwin-Windows/cppapplication_2.exe
make[2]: Entering directory `/cygdrive/c/Users/kubiaxk/Documents/NetBeansProjects/CppApplication_2'
mkdir -p build/Debug/Cygwin-Windows
rm -f build/Debug/Cygwin-Windows/main.o.d
gcc.exe -c -g -MMD -MP -MF build/Debug/Cygwin-Windows/main.o.d -o build/Debug/Cygwin-Windows/main.o main.c
nbproject/Makefile-Debug.mk:65: recipe for target `build/Debug/Cygwin-Windows/main.o' failed
make[2]: Leaving directory `/cygdrive/c/Users/kubiaxk/Documents/NetBeansProjects/CppApplication_2'
nbproject/Makefile-Debug.mk:58: recipe for target `.build-conf' failed
make[1]: Leaving directory `/cygdrive/c/Users/kubiaxk/Documents/NetBeansProjects/CppApplication_2'
nbproject/Makefile-impl.mk:39: recipe for target `.build-impl' failed
make[2]: gcc.exe: Command not found
make[2]: *** [build/Debug/Cygwin-Windows/main.o] Error 127
make[1]: *** [.build-conf] Error 2
make: *** [.build-impl] Error 2
BUILD FAILED (exit value 2, total time: 2s)
+ wtf je toto a ma to asi suvis s tym ze mi to zase nejde debugnut co ?
(https://www.tu-ke.com/forum/proxy.php?request=http%3A%2F%2Fkubiaxk.hustej.net%2Fnb%2F5.png&hash=1530705a374668ab066e2f5ecdf1e9a35d8972bb)
(https://www.tu-ke.com/forum/proxy.php?request=http%3A%2F%2Fkubiaxk.hustej.net%2Fnb%2F6.png&hash=113a85802072154f8c321364c163d1a61369ac04)
sorry fakt som v tom lama a nevyznam sa v tych vypisoch .... tak to davam sem
Rád by som ti poradil Kubo, ale neviem čo ti tam môže nejisť..
Ja to mám na w7 a normalne mi to ide...možno si fakt dačo preskočil pri inštalácii, inak neviem..
Treba pekne všetko aj tie kompilery zaškrtnúť pri inštalácii a potom to nastaviť...
Pri vytváraní projektu tiež treba zvoliť správne C aplication...nastaviť external terminal na každý projekt...
ozaj, či si nezabudol pri inštalácii zaškrtnúť ten make compiler....
klikni pravym na projekt daj propertie a posli screen a posli screen zalozky build
(https://www.tu-ke.com/forum/proxy.php?request=http%3A%2F%2Fkubiaxk.hustej.net%2Fnb%2F7.png&hash=6f2f2f3b474f927b8f4aac3a44d654dc0d842601)
tuto na netbooku to neviem rozbehat :D este ze na PC mi to ide :buttrock:
#lilu ne ne pri inštalácií som nezabudol na nič ...
pravdepodobne mas ryzu v nastaveni nastrojov pre jazyk C. otazkou totiz je, ako je tato sada pomenovana v netbeanse a aka je zvolena v projekte (podla tvojho posledneho screenu je to cast Tool Collection s hodnotou Default: Cygwin). skontroluj si este v hlavnom okne cez menu Tools->Options, v dialogovom okne klikaj na C/C++ a pozri sa, ktora z tvojej sady je naozaj aktivna (ma rozpoznane/nainstalovane vsetky nastroje, ako sa vola, ...) no a prave tuto sadu potrebujes vybrat/zvolit aj pre tvoj projekt.
keď sa tu už riešia problémy s NB, neviem prečo ale "podčiarkuje" mi printf a scanf funkciu...akoby ich nevedel nájsť, pričom všetko skompiluje úspešne, program sa spusti, žiadny error, warningy... includy samozrejme, že mám, inak by mi to neskompilovalo...any idea ? Robí mi to len pri "printf" a "scanf"... pri červenom výkričníku mi píše: "Unable to resolve identifier printf(scanf) " ...
Quote from: Rajo on 10.04.2012, 15:48:21
keď sa tu už riešia problémy s NB, neviem prečo ale "podčiarkuje" mi printf a scanf funkciu...akoby ich nevedel nájsť, pričom všetko skompiluje úspešne, program sa spusti, žiadny error, warningy... includy samozrejme, že mám, inak by mi to neskompilovalo...any idea ? Robí mi to len pri "printf" a "scanf"... pri červenom výkričníku mi píše: "Unable to resolve identifier printf(scanf) " ...
Máš tam červený výkričník a skompiluje ti to ? :O
Zatiaľ som si žil s mylnou predstavou že len žlté výkričníky (warningy) ti dovolí kompilovať :D
Quote from: Informatik on 10.04.2012, 18:57:57
Quote from: Rajo on 10.04.2012, 15:48:21
keď sa tu už riešia problémy s NB, neviem prečo ale "podčiarkuje" mi printf a scanf funkciu...akoby ich nevedel nájsť, pričom všetko skompiluje úspešne, program sa spusti, žiadny error, warningy... includy samozrejme, že mám, inak by mi to neskompilovalo...any idea ? Robí mi to len pri "printf" a "scanf"... pri červenom výkričníku mi píše: "Unable to resolve identifier printf(scanf) " ...
Máš tam červený výkričník a skompiluje ti to ? :O
Zatiaľ som si žil s mylnou predstavou že len žlté výkričníky (warningy) ti dovolí kompilovať :D
ano, pretože v stdio je printf a aj scanf...akoby to NB nevedel zistiť, že to má knižnica stdio..abo ja neznám čo :D
Problem sloved .... preinštaloval som OEM W7 starter za pančovaný Ultimate x64 a nainštaloval znova a všetko už ide jak ma .... takže W7 s = MEGAULTRABULŠIT
windoze vseobecne, no ale to patri inam..